{"text_format":"3","workbook":"xlsx","n_sheets":2,"sheets":["Kalender","Fixtermine"],"not_rendered":{"defined_names":3,"comments":1},"read":"whole","date_system":"1900"}

{"sheet":"Kalender","index":0,"n_rows":369,"n_cols":11,"rows_kept":369}
["Wochentag","Datum","Fixtage","Uhrzeit",{"$f":"CONCATENATE(\"Termine für das Jahr \",YEAR(B2))","v":"Termine für das Jahr 2018"},"Ort","Bemerkungen",{"$f":"TODAY()","v":"2018-05-15"},"Termine eingeben","TT.MM."]
[{"$f":"CHOOSE(WEEKDAY(B2),\"Sonntag\",\"Montag\",\"Dienstag\",\"Mittwoch\",\"Donnerstag\",\"Freitag\",\"Samstag\")","v":"Montag"},"2018-01-01",{"$f":"IFERROR(VLOOKUP(B2,Fixtermine!$B$1:$E$208,3,FALSE),\"\")","v":"FT-Neujahr"},{"$nulls":5},"Beginn der Sommerferien","30.07.","<<(Punkte nicht vergessen)"]
[{"$f":"CHOOSE(WEEKDAY(B3),\"Sonntag\",\"Montag\",\"Dienstag\",\"Mittwoch\",\"Donnerstag\",\"Freitag\",\"Samstag\")","v":"Dienstag"},{"$f":"B2+1","v":"2018-01-02"},{"$f":"IFERROR(VLOOKUP(B3,Fixtermine!$B$1:$E$208,3,FALSE),\"\")","v":"Weihnachtsferien"},{"$nulls":5},"Ende der Sommerferien","12.09.","<<(Punkte nicht vergessen)"]
["Mittwoch","2018-01-03",{"$f":"IFERROR(VLOOKUP(B4,Fixtermine!$B$1:$E$208,3,FALSE),\"\")","v":"Weihnachtsferien"}]
["Donnerstag","2018-01-04",{"$f":"IFERROR(VLOOKUP(B5,Fixtermine!$B$1:$E$208,3,FALSE),\"\")","v":"Weihnachtsferien"}]
["Freitag","2018-01-05",{"$f":"IFERROR(VLOOKUP(B6,Fixtermine!$B$1:$E$208,3,FALSE),\"\")","v":"Weihnachtsferien"}]
["Samstag","2018-01-06",{"$f":"IFERROR(VLOOKUP(B7,Fixtermine!$B$1:$E$208,3,FALSE),\"\")","v":"FT-Hl. 3 Könige"}]
["Sonntag","2018-01-07",{"$f":"IFERROR(VLOOKUP(B8,Fixtermine!$B$1:$E$208,3,FALSE),\"\")","v":""}]
["Montag","2018-01-08",{"$f":"IFERROR(VLOOKUP(B9,Fixtermine!$B$1:$E$208,3,FALSE),\"\")","v":""}]
["Dienstag","2018-01-09",{"$f":"IFERROR(VLOOKUP(B10,Fixtermine!$B$1:$E$208,3,FALSE),\"\")","v":""}]
["Mittwoch","2018-01-10",{"$f":"IFERROR(VLOOKUP(B11,Fixtermine!$B$1:$E$208,3,FALSE),\"\")","v":""}]
["Donnerstag","2018-01-11",{"$f":"IFERROR(VLOOKUP(B12,Fixtermine!$B$1:$E$208,3,FALSE),\"\")","v":""}]
["Freitag","2018-01-12",{"$f":"IFERROR(VLOOKUP(B13,Fixtermine!$B$1:$E$208,3,FALSE),\"\")","v":""}]
["Samstag","2018-01-13",{"$f":"IFERROR(VLOOKUP(B14,Fixtermine!$B$1:$E$208,3,FALSE),\"\")","v":""}]
["Sonntag","2018-01-14",{"$f":"IFERROR(VLOOKUP(B15,Fixtermine!$B$1:$E$208,3,FALSE),\"\")","v":""}]
["Montag","2018-01-15",{"$f":"IFERROR(VLOOKUP(B16,Fixtermine!$B$1:$E$208,3,FALSE),\"\")","v":""}]
["Dienstag","2018-01-16",{"$f":"IFERROR(VLOOKUP(B17,Fixtermine!$B$1:$E$208,3,FALSE),\"\")","v":""}]
["Mittwoch","2018-01-17",{"$f":"IFERROR(VLOOKUP(B18,Fixtermine!$B$1:$E$208,3,FALSE),\"\")","v":""}]
["Donnerstag","2018-01-18",{"$f":"IFERROR(VLOOKUP(B19,Fixtermine!$B$1:$E$208,3,FALSE),\"\")","v":""}]
["Freitag","2018-01-19",{"$f":"IFERROR(VLOOKUP(B20,Fixtermine!$B$1:$E$208,3,FALSE),\"\")","v":""}]
["Samstag","2018-01-20",{"$f":"IFERROR(VLOOKUP(B21,Fixtermine!$B$1:$E$208,3,FALSE),\"\")","v":""}]
["Sonntag","2018-01-21",{"$f":"IFERROR(VLOOKUP(B22,Fixtermine!$B$1:$E$208,3,FALSE),\"\")","v":""}]
["Montag","2018-01-22",{"$f":"IFERROR(VLOOKUP(B23,Fixtermine!$B$1:$E$208,3,FALSE),\"\")","v":""}]
["Dienstag","2018-01-23",{"$f":"IFERROR(VLOOKUP(B24,Fixtermine!$B$1:$E$208,3,FALSE),\"\")","v":""}]
["Mittwoch","2018-01-24",{"$f":"IFERROR(VLOOKUP(B25,Fixtermine!$B$1:$E$208,3,FALSE),\"\")","v":""}]
["Donnerstag","2018-01-25",{"$f":"IFERROR(VLOOKUP(B26,Fixtermine!$B$1:$E$208,3,FALSE),\"\")","v":""}]
["Freitag","2018-01-26",{"$f":"IFERROR(VLOOKUP(B27,Fixtermine!$B$1:$E$208,3,FALSE),\"\")","v":""}]
["Samstag","2018-01-27",{"$f":"IFERROR(VLOOKUP(B28,Fixtermine!$B$1:$E$208,3,FALSE),\"\")","v":""}]
["Sonntag","2018-01-28",{"$f":"IFERROR(VLOOKUP(B29,Fixtermine!$B$1:$E$208,3,FALSE),\"\")","v":""}]
["Montag","2018-01-29",{"$f":"IFERROR(VLOOKUP(B30,Fixtermine!$B$1:$E$208,3,FALSE),\"\")","v":""}]
["Dienstag","2018-01-30",{"$f":"IFERROR(VLOOKUP(B31,Fixtermine!$B$1:$E$208,3,FALSE),\"\")","v":""}]
["Mittwoch","2018-01-31",{"$f":"IFERROR(VLOOKUP(B32,Fixtermine!$B$1:$E$208,3,FALSE),\"\")","v":""}]
["Donnerstag","2018-02-01",{"$f":"IFERROR(VLOOKUP(B33,Fixtermine!$B$1:$E$208,3,FALSE),\"\")","v":""}]
["Freitag","2018-02-02",{"$f":"IFERROR(VLOOKUP(B34,Fixtermine!$B$1:$E$208,3,FALSE),\"\")","v":""}]
["Samstag","2018-02-03",{"$f":"IFERROR(VLOOKUP(B35,Fixtermine!$B$1:$E$208,3,FALSE),\"\")","v":""}]
["Sonntag","2018-02-04",{"$f":"IFERROR(VLOOKUP(B36,Fixtermine!$B$1:$E$208,3,FALSE),\"\")","v":""}]
["Montag","2018-02-05",{"$f":"IFERROR(VLOOKUP(B37,Fixtermine!$B$1:$E$208,3,FALSE),\"\")","v":""}]
["Dienstag","2018-02-06",{"$f":"IFERROR(VLOOKUP(B38,Fixtermine!$B$1:$E$208,3,FALSE),\"\")","v":""}]
["Mittwoch","2018-02-07",{"$f":"IFERROR(VLOOKUP(B39,Fixtermine!$B$1:$E$208,3,FALSE),\"\")","v":""}]
["Donnerstag","2018-02-08",{"$f":"IFERROR(VLOOKUP(B40,Fixtermine!$B$1:$E$208,3,FALSE),\"\")","v":""}]
["Freitag","2018-02-09",{"$f":"IFERROR(VLOOKUP(B41,Fixtermine!$B$1:$E$208,3,FALSE),\"\")","v":""}]
["Samstag","2018-02-10",{"$f":"IFERROR(VLOOKUP(B42,Fixtermine!$B$1:$E$208,3,FALSE),\"\")","v":""}]
["Sonntag","2018-02-11",{"$f":"IFERROR(VLOOKUP(B43,Fixtermine!$B$1:$E$208,3,FALSE),\"\")","v":""}]
["Montag","2018-02-12",{"$f":"IFERROR(VLOOKUP(B44,Fixtermine!$B$1:$E$208,3,FALSE),\"\")","v":"Frühjahrsferien"}]
["Dienstag","2018-02-13",{"$f":"IFERROR(VLOOKUP(B45,Fixtermine!$B$1:$E$208,3,FALSE),\"\")","v":"Frühjahrsferien"}]
["Mittwoch","2018-02-14",{"$f":"IFERROR(VLOOKUP(B46,Fixtermine!$B$1:$E$208,3,FALSE),\"\")","v":"Aschermittw. / Ferien"}]
["Donnerstag","2018-02-15",{"$f":"IFERROR(VLOOKUP(B47,Fixtermine!$B$1:$E$208,3,FALSE),\"\")","v":"Frühjahrsferien"}]
["Freitag","2018-02-16",{"$f":"IFERROR(VLOOKUP(B48,Fixtermine!$B$1:$E$208,3,FALSE),\"\")","v":"Frühjahrsferien"}]
["Samstag","2018-02-17",{"$f":"IFERROR(VLOOKUP(B49,Fixtermine!$B$1:$E$208,3,FALSE),\"\")","v":""}]
["Sonntag","2018-02-18",{"$f":"IFERROR(VLOOKUP(B50,Fixtermine!$B$1:$E$208,3,FALSE),\"\")","v":""}]
["Montag","2018-02-19",{"$f":"IFERROR(VLOOKUP(B51,Fixtermine!$B$1:$E$208,3,FALSE),\"\")","v":""}]
["Dienstag","2018-02-20",{"$f":"IFERROR(VLOOKUP(B52,Fixtermine!$B$1:$E$208,3,FALSE),\"\")","v":""}]
["Mittwoch","2018-02-21",{"$f":"IFERROR(VLOOKUP(B53,Fixtermine!$B$1:$E$208,3,FALSE),\"\")","v":""}]
["Donnerstag","2018-02-22",{"$f":"IFERROR(VLOOKUP(B54,Fixtermine!$B$1:$E$208,3,FALSE),\"\")","v":""}]
["Freitag","2018-02-23",{"$f":"IFERROR(VLOOKUP(B55,Fixtermine!$B$1:$E$208,3,FALSE),\"\")","v":""}]
["Samstag","2018-02-24",{"$f":"IFERROR(VLOOKUP(B56,Fixtermine!$B$1:$E$208,3,FALSE),\"\")","v":""}]
["Sonntag","2018-02-25",{"$f":"IFERROR(VLOOKUP(B57,Fixtermine!$B$1:$E$208,3,FALSE),\"\")","v":""}]
["Montag","2018-02-26",{"$f":"IFERROR(VLOOKUP(B58,Fixtermine!$B$1:$E$208,3,FALSE),\"\")","v":""}]
["Dienstag","2018-02-27",{"$f":"IFERROR(VLOOKUP(B59,Fixtermine!$B$1:$E$208,3,FALSE),\"\")","v":""}]
["Mittwoch","2018-02-28",{"$f":"IFERROR(VLOOKUP(B60,Fixtermine!$B$1:$E$208,3,FALSE),\"\")","v":""}]
["Donnerstag","2018-03-01",{"$f":"IFERROR(VLOOKUP(B61,Fixtermine!$B$1:$E$208,3,FALSE),\"\")","v":""}]
["Freitag","2018-03-02",{"$f":"IFERROR(VLOOKUP(B62,Fixtermine!$B$1:$E$208,3,FALSE),\"\")","v":""}]
["Samstag","2018-03-03",{"$f":"IFERROR(VLOOKUP(B63,Fixtermine!$B$1:$E$208,3,FALSE),\"\")","v":""}]
["Sonntag","2018-03-04",{"$f":"IFERROR(VLOOKUP(B64,Fixtermine!$B$1:$E$208,3,FALSE),\"\")","v":""}]
["Montag","2018-03-05",{"$f":"IFERROR(VLOOKUP(B65,Fixtermine!$B$1:$E$208,3,FALSE),\"\")","v":""}]
["Dienstag","2018-03-06",{"$f":"IFERROR(VLOOKUP(B66,Fixtermine!$B$1:$E$208,3,FALSE),\"\")","v":""}]
[{"$f":"CHOOSE(WEEKDAY(B67),\"Sonntag\",\"Montag\",\"Dienstag\",\"Mittwoch\",\"Donnerstag\",\"Freitag\",\"Samstag\")","v":"Mittwoch"},"2018-03-07",{"$f":"IFERROR(VLOOKUP(B67,Fixtermine!$B$1:$E$208,3,FALSE),\"\")","v":""}]
["Donnerstag","2018-03-08",{"$f":"IFERROR(VLOOKUP(B68,Fixtermine!$B$1:$E$208,3,FALSE),\"\")","v":""}]
["Freitag",{"$f":"B68+1","v":"2018-03-09"},{"$f":"IFERROR(VLOOKUP(B69,Fixtermine!$B$1:$E$208,3,FALSE),\"\")","v":""}]
["Samstag","2018-03-10",{"$f":"IFERROR(VLOOKUP(B70,Fixtermine!$B$1:$E$208,3,FALSE),\"\")","v":""}]
["Sonntag","2018-03-11",{"$f":"IFERROR(VLOOKUP(B71,Fixtermine!$B$1:$E$208,3,FALSE),\"\")","v":""}]
["Montag","2018-03-12",{"$f":"IFERROR(VLOOKUP(B72,Fixtermine!$B$1:$E$208,3,FALSE),\"\")","v":""}]
["Dienstag","2018-03-13",{"$f":"IFERROR(VLOOKUP(B73,Fixtermine!$B$1:$E$208,3,FALSE),\"\")","v":""}]
["Mittwoch","2018-03-14",{"$f":"IFERROR(VLOOKUP(B74,Fixtermine!$B$1:$E$208,3,FALSE),\"\")","v":""}]
["Donnerstag","2018-03-15",{"$f":"IFERROR(VLOOKUP(B75,Fixtermine!$B$1:$E$208,3,FALSE),\"\")","v":""}]
["Freitag","2018-03-16",{"$f":"IFERROR(VLOOKUP(B76,Fixtermine!$B$1:$E$208,3,FALSE),\"\")","v":""}]
["Samstag","2018-03-17",{"$f":"IFERROR(VLOOKUP(B77,Fixtermine!$B$1:$E$208,3,FALSE),\"\")","v":""}]
["Sonntag","2018-03-18",{"$f":"IFERROR(VLOOKUP(B78,Fixtermine!$B$1:$E$208,3,FALSE),\"\")","v":""}]
["Montag","2018-03-19",{"$f":"IFERROR(VLOOKUP(B79,Fixtermine!$B$1:$E$208,3,FALSE),\"\")","v":""}]
["Dienstag","2018-03-20",{"$f":"IFERROR(VLOOKUP(B80,Fixtermine!$B$1:$E$208,3,FALSE),\"\")","v":""}]
{"$rows_left_out":290}
{"sheet":"Fixtermine","index":1,"n_rows":208,"n_cols":11,"rows_kept":208,"hidden":true,"merged":[[1,6,12,6],[43,6,43,8],[105,6,116,6],[147,6,147,8]]}
[{"$f":"CHOOSE(WEEKDAY(E1),\"Sonntag\",\"Montag\",\"Dienstag\",\"Mittwoch\",\"Donnerstag\",\"Freitag\",\"Samstag\")","v":"Sonntag"},{"$f":"B2-7","v":43436},null,"1. Advent",{"$f":"B1","v":"2018-12-02"},null,"Jahr",{"$f":"YEAR(Kalender!B2)","v":2018}]
["Sonntag",{"$f":"B3-7","v":43443},null,"2. Advent","2018-12-09",null,"Gausssche Osterformel",{"$f":"MOD(H1,19)","v":4}]
["Sonntag",{"$f":"B4-7","v":43450},null,"3. Advent","2018-12-16",null,null,{"$f":"MOD(H1,4)","v":2}]
["Sonntag",{"$f":"B7-WEEKDAY(B7)+1","v":43457},null,{"$f":"IF(WEEKDAY(B7)=1,D7,\"4. Apfent\")","v":"4. Apfent"},{"$f":"B4","v":"2018-12-23"},null,null,{"$f":"MOD(H1,7)","v":2}]
[{"$f":"CHOOSE(WEEKDAY(E5),\"Sonntag\",\"Montag\",\"Dienstag\",\"Mittwoch\",\"Donnerstag\",\"Freitag\",\"Samstag\")","v":"Mittwoch"},{"$f":"DATEVALUE(E5)","v":43376},"03.10.","FT-Tag d. Deut. Einheit",{"$f":"CONCATENATE(C5,$H$1)","v":"03.10.2018"},null,null,{"$f":"TRUNC((8*(TRUNC(H1/100))+13)/25)-2","v":4}]
["Donnerstag",43405,"01.11.","FT-Allerheiligen","01.11.2018",null,null,{"$f":"TRUNC(H1/100)-TRUNC(H1/400)-2","v":13}]
["Montag",43458,"24.12.","Hl. Abend / Ferien","24.12.2018",null,null,{"$f":"MOD(15+H6-H5,30)","v":24}]
["Dienstag",43459,"25.12.","FT-1. Weihnachtsfeiertag","25.12.2018",null,null,{"$f":"MOD(6+H6,7)","v":5}]
["Mittwoch",43460,"26.12.","FT-2. Weihnachtsfeiertag","26.12.2018",null,null,{"$f":"MOD(H7+19*H2,30)","v":10}]
["Montag",43101,"01.01.","FT-Neujahr","01.01.2018",null,null,{"$f":"IF(H9=29,28,IF(AND(H9=28,H2>=11),27,IF(AND(H9<28,H9>29),,H9)))","v":10}]
["Samstag",43106,"06.01.","FT-Hl. 3 Könige","06.01.2018",null,null,{"$f":"MOD(2*H3+4*H4+6*H10+H8,7)","v":0}]
["Dienstag",43221,"01.05.","FT-Tag der Arbeit","01.05.2018",null,null,{"$f":"H10+H11+1","v":11}]
["Mittwoch",43327,"15.08.","FT-Maria Himmeklfahrt","15.08.2018",null,null,{"$f":"DATEVALUE(CONCATENATE(\"21.märz\",H1))","v":43180}]
["Montag",{"$f":"$B$6+2-$I$31","v":43402},null,"Herbstferien",{"$f":"B14","v":"2018-10-29"},null,"Ostersonntag",{"$f":"H12+H13","v":"2018-04-01"}]
["Dienstag",{"$f":"$B$6+3-$I$31","v":43403},null,"Herbstferien","2018-10-30",null,"Tag",{"$f":"DAY(H14)","v":1}]
["Mittwoch",{"$f":"$B$6+4-$I$31","v":43404},null,"Herbstferien",{"$f":"B16","v":"2018-10-31"},null,"Monat",{"$f":"MONTH(H14)","v":4}]
["Donnerstag",{"$f":"$B$6+5-$I$31","v":43405},null,"Herbstferien",{"$f":"B17","v":"2018-11-01"},null,"Jahr",{"$f":"YEAR(H14)","v":2018}]
["Freitag",{"$f":"$B$6+6-$I$31","v":43406},null,"Herbstferien",{"$f":"B18","v":"2018-11-02"},null,"Zusammengebastelt",{"$f":"CONCATENATE(H15,\".\",H16,\".\",H17)","v":"1.4.2018"}]
["Mittwoch",{"$f":"DATEVALUE(E19)","v":43425},{"$f":"VLOOKUP(4,$G$23:$J$29,3,TRUE)","v":"21.11."},"Buß- u. Bettag",{"$f":"CONCATENATE(C19,$H$1)","v":"21.11.2018"}]
["Donnerstag",43461,"27.12.","Weihnachtsferien","27.12.2018",null,"akt. Dat.(Heute)",{"$f":"TODAY()","v":43235}]
["Freitag",43462,"28.12.","Weihnachtsferien","28.12.2018"]
["Samstag",43463,"29.12.","Weihnachtsferien","29.12.2018",null,"Buß- u. Bettag zw. 16.11. und 22.11."]
["Sonntag",43464,"30.12.","Weihnachtsferien","30.12.2018",null,{"$f":"WEEKDAY(J23)","v":6},{"$f":"CHOOSE(WEEKDAY(J23),\"Sonntag\",\"Montag\",\"Dienstag\",\"Mittwoch\",\"Donnerstag\",\"Freitag\",\"Samstag\")","v":"Freitag"},"16.11.",{"$f":"CONCATENATE(I23,$H$1)","v":"16.11.2018"}]
["Montag",43465,"31.12.","Weihnachtsferien","31.12.2018",null,7,"Samstag","17.11.","17.11.2018"]
["Dienstag",43102,"02.01.","Weihnachtsferien","02.01.2018",null,1,"Sonntag","18.11.","18.11.2018"]
["Mittwoch",43103,"03.01.","Weihnachtsferien","03.01.2018",null,2,"Montag","19.11.","19.11.2018"]
["Donnerstag",43104,"04.01.","Weihnachtsferien","04.01.2018",null,3,"Dienstag","20.11.","20.11.2018"]
["Freitag",43105,"05.01.","Weihnachtsferien","05.01.2018",null,4,"Mittwoch","21.11.","21.11.2018"]
["Montag",{"$f":"DATEVALUE(H$18)-48","v":43143},null,"Frühjahrsferien",{"$f":"B29","v":"2018-02-12"},null,5,"Donnerstag","22.11.","22.11.2018"]
["Dienstag",{"$f":"DATEVALUE(H$18)-47","v":43144},null,"Frühjahrsferien","2018-02-13"]
["Mittwoch",{"$f":"DATEVALUE(H$18)-46","v":43145},null,"Aschermittw. / Ferien","2018-02-14",null,"Herbstferienberechn.","Wochentagserm.",{"$f":"VLOOKUP(C6,G32:J42,2,TRUE)","v":5},{"$f":"CHOOSE(WEEKDAY(I31),\"Sonntag\",\"Montag\",\"Dienstag\",\"Mittwoch\",\"Donnerstag\",\"Freitag\",\"Samstag\")","v":"Donnerstag"}]
["Donnerstag",{"$f":"DATEVALUE(H$18)-45","v":43146},null,"Frühjahrsferien","2018-02-15",null,"27.10.",{"$f":"WEEKDAY(J32)","v":7},{"$f":"CHOOSE(WEEKDAY(J32),\"Sonntag\",\"Montag\",\"Dienstag\",\"Mittwoch\",\"Donnerstag\",\"Freitag\",\"Samstag\")","v":"Samstag"},{"$f":"CONCATENATE(G32,$H$1)","v":"27.10.2018"}]
["Freitag",{"$f":"DATEVALUE(H$18)-44","v":43147},null,"Frühjahrsferien","2018-02-16",null,"28.10.",1,"Sonntag","28.10.2018"]
["Montag",{"$f":"DATEVALUE(H$18)-6","v":43185},null,"Osterferien","2018-03-26",null,"29.10.",2,"Montag","29.10.2018"]
["Dienstag",{"$f":"DATEVALUE(H$18)-5","v":43186},null,"Osterferien","2018-03-27",null,"30.10.",3,"Dienstag","30.10.2018"]
["Mittwoch",{"$f":"DATEVALUE(H$18)-4","v":43187},null,"Osterferien","2018-03-28",null,"31.10.",4,"Mittwoch","31.10.2018"]
["Donnerstag",{"$f":"DATEVALUE(H$18)-3","v":43188},null,"Osterferien","2018-03-29",null,"01.11.",5,"Donnerstag","01.11.2018"]
["Freitag",{"$f":"DATEVALUE(H$18)-2","v":43189},null,"FT-Karfreitag","2018-03-30",null,"02.11.",6,"Freitag","02.11.2018"]
["Samstag",{"$f":"DATEVALUE(H$18)-1","v":43190},null,"Osterferien","2018-03-31",null,"03.11.",7,"Samstag","03.11.2018"]
[{"$f":"CHOOSE(WEEKDAY(E47),\"Sonntag\",\"Montag\",\"Dienstag\",\"Mittwoch\",\"Donnerstag\",\"Freitag\",\"Samstag\")","v":"Sonntag"},{"$f":"DATEVALUE(H$18)","v":43191},null,"FT-Ostersonntag","2018-04-01",null,"04.11.",1,"Sonntag","04.11.2018"]
[{"$f":"CHOOSE(WEEKDAY(E41),\"Sonntag\",\"Montag\",\"Dienstag\",\"Mittwoch\",\"Donnerstag\",\"Freitag\",\"Samstag\")","v":"Montag"},{"$f":"DATEVALUE(H$18)+1","v":43192},null,"FT-Ostermontag","2018-04-02",null,"05.11.",2,"Montag","05.11.2018"]
["Dienstag",{"$f":"DATEVALUE(H$18)+2","v":43193},null,"Osterferien","2018-04-03",null,"06.11.",3,"Dienstag","06.11.2018"]
["Mittwoch",{"$f":"DATEVALUE(H$18)+3","v":43194},null,"Osterferien","2018-04-04"]
["Donnerstag",{"$f":"DATEVALUE(H$18)+4","v":43195},null,"Osterferien","2018-04-05",null,"Sommerferientabelle",null,null,"Beginn","Ende (einschließlich)"]
["Freitag",{"$f":"DATEVALUE(H$18)+5","v":43196},null,"Osterferien","2018-04-06",null,{"$f":"IF(J45=0,\"\",YEAR(J45))","v":2016},{"$f":"IF(J45=0,\"\",CONCATENATE(IF(DAY(J45)<10,CONCATENATE(\"0\",DAY(J45)),DAY(J45)),\".\",IF(MONTH(J45)<10,CONCATENATE(\"0\",MONTH(J45)),MONTH(J45)),\".\"))","v":"30.07."},{"$f":"IF(K45=0,\"\",CONCATENATE(IF(DAY(K45)<10,CONCATENATE(\"0\",DAY(K45)),DAY(K45)),\".\",IF(MONTH(K45)<10,CONCATENATE(\"0\",MONTH(K45)),MONTH(K45)),\".\"))","v":"12.09."},"2016-07-30","2016-09-12"]
["Donnerstag",{"$f":"DATEVALUE(H$18)+39","v":43230},null,"FT-Ch. Himmelfahrt","2018-05-10",null,{"$f":"IF(J46=0,\"\",YEAR(J46))","v":2017},{"$f":"IF(J46=0,\"\",CONCATENATE(IF(DAY(J46)<10,CONCATENATE(\"0\",DAY(J46)),DAY(J46)),\".\",IF(MONTH(J46)<10,CONCATENATE(\"0\",MONTH(J46)),MONTH(J46)),\".\"))","v":"29.07."},{"$f":"IF(K46=0,\"\",CONCATENATE(IF(DAY(K46)<10,CONCATENATE(\"0\",DAY(K46)),DAY(K46)),\".\",IF(MONTH(K46)<10,CONCATENATE(\"0\",MONTH(K46)),MONTH(K46)),\".\"))","v":"11.09."},"2017-07-29","2017-09-11"]
["Sonntag",{"$f":"DATEVALUE(H$18)+49","v":43240},null,"FT-Pfingstsonntag","2018-05-20",null,2018,"30.07.","10.09.","2018-07-30","2018-09-10"]
["Montag",{"$f":"DATEVALUE(H$18)+50","v":43241},null,"FT-Pfingstmontag","2018-05-21",null,2019,"29.07.","09.09.","2019-07-29","2019-09-09"]
["Dienstag",{"$f":"DATEVALUE(H$18)+51","v":43242},null,"Pfingstferien","2018-05-22",null,2020,"27.07.","07.09.","2020-07-27","2020-09-07"]
["Mittwoch",{"$f":"DATEVALUE(H$18)+52","v":43243},null,"Pfingstferien","2018-05-23",null,2021,"30.07.","13.09.","2021-07-30","2021-09-13"]
["Donnerstag",{"$f":"DATEVALUE(H$18)+53","v":43244},null,"Pfingstferien","2018-05-24",null,2022,"01.08.","12.09.","2022-08-01","2022-09-12"]
["Freitag",{"$f":"DATEVALUE(H$18)+54","v":43245},null,"Pfingstferien","2018-05-25",null,2023,"31.07.","11.09.","2023-07-31","2023-09-11"]
["Samstag",{"$f":"DATEVALUE(H$18)+55","v":43246},null,"Pfingstferien","2018-05-26",null,2024,"29.07.","09.09.","2024-07-29","2024-09-09"]
["Sonntag",{"$f":"DATEVALUE(H$18)+56","v":43247},null,"Pfingstferien","2018-05-27",null,"","",""]
["Montag",{"$f":"DATEVALUE(H$18)+57","v":43248},null,"Pfingstferien","2018-05-28",null,"","",""]
["Dienstag",{"$f":"DATEVALUE(H$18)+58","v":43249},null,"Pfingstferien","2018-05-29",null,"","",""]
["Mittwoch",{"$f":"DATEVALUE(H$18)+59","v":43250},null,"Pfingstferien","2018-05-30",null,"","",""]
["Donnerstag",{"$f":"DATEVALUE(H$18)+60","v":43251},null,"FT-Fronleichnam","2018-05-31",null,"","",""]
["Freitag",{"$f":"DATEVALUE(H$18)+61","v":43252},null,"Pfingstferien","2018-06-01",null,"","",""]
["Montag",{"$f":"DATEVALUE(E60)","v":43311},{"$f":"$H$103","v":"30.07."},"Sommerferien",{"$f":"CONCATENATE(C60,$H$1)","v":"30.07.2018"},null,"","",""]
["Dienstag",{"$f":"IF((B60+1)<$B$104,B60+1,$B$104)","v":43312},null,"Sommerferien",{"$f":"B61","v":"2018-07-31"},null,"","",""]
["Mittwoch",43313,null,"Sommerferien","2018-08-01",null,"","",""]
["Donnerstag",43314,null,"Sommerferien","2018-08-02",null,"","",""]
["Freitag",43315,null,"Sommerferien","2018-08-03",null,"","",""]
["Samstag",43316,null,"Sommerferien","2018-08-04",null,"","",""]
["Sonntag",43317,null,"Sommerferien","2018-08-05",null,"","",""]
["Montag",43318,null,"Sommerferien","2018-08-06",null,"","",""]
["Dienstag",43319,null,"Sommerferien","2018-08-07",null,"","",""]
["Mittwoch",43320,null,"Sommerferien",{"$f":"B69","v":"2018-08-08"},null,"","",""]
["Donnerstag",43321,null,"Sommerferien","2018-08-09",null,"","",""]
["Freitag",43322,null,"Sommerferien","2018-08-10",null,"","",""]
["Samstag",43323,null,"Sommerferien","2018-08-11",null,"","",""]
[{"$f":"CHOOSE(WEEKDAY(E73),\"Sonntag\",\"Montag\",\"Dienstag\",\"Mittwoch\",\"Donnerstag\",\"Freitag\",\"Samstag\")","v":"Sonntag"},43324,null,"Sommerferien","2018-08-12",null,"","",""]
["Montag",43325,null,"Sommerferien","2018-08-13",null,"","",""]
["Dienstag",43326,null,"Sommerferien","2018-08-14",null,"","",""]
["Mittwoch",43327,null,"Sommerferien","2018-08-15",null,"","",""]
["Donnerstag",43328,null,"Sommerferien","2018-08-16",null,"","",""]
["Freitag",43329,null,"Sommerferien","2018-08-17",null,"","",{"$f":"IF(K78=0,\"\",CONCATENATE(IF(DAY(K78)<10,CONCATENATE(\"0\",DAY(K78)),DAY(K78)),\".\",IF(MONTH(K78)<10,CONCATENATE(\"0\",MONTH(K78)),MONTH(K78)),\".\"))","v":""}]
["Samstag",43330,null,"Sommerferien","2018-08-18",null,"","",""]
["Sonntag",43331,null,"Sommerferien","2018-08-19",null,"","",""]
{"$rows_left_out":128}