{"text_format":"1","workbook":"xlsx","n_sheets":2,"sheets":["Kalender","Fixtermine"],"not_rendered":{"charts":0,"images":0,"macros":0,"external_links":0,"defined_names":3,"comments":1,"pivot_tables":0},"unopened":[],"bounds":{"document_bytes":16777216,"sheet_cells":100000,"rows_first":2000,"rows_last":500,"rows_between":2000,"halvings":0,"cell_chars":16384,"cell_head_chars":4096},"cells_cut":0,"cells_raw":0,"read":"whole","date_system":"1900"}

{"sheet":"Kalender","index":0,"n_rows":330,"n_cols":13,"rows_kept":330,"cut":false,"hidden":false,"merged":[]}
["Wochentag","Datum","Fixtage",null,"Uhrzeit",{"$f":"CONCATENATE(\"Termine für das Schuljahr \",YEAR(B2),\"-\",YEAR(B2)+1)","v":"Termine für das Schuljahr 2016-2017"},"Ort","Ferientermine","Bemerkungen",{"$f":"TODAY()","v":"2015-12-26"},"Termin eingeben","TT.MM."]
[{"$f":"CHOOSE(WEEKDAY(B2),\"Sonntag\",\"Montag\",\"Dienstag\",\"Mittwoch\",\"Donnerstag\",\"Freitag\",\"Samstag\")","v":"Montag"},"2016-09-12",{"$f":"IFERROR(VLOOKUP(B2,Fixtermine!$B$1:$E$68,3,FALSE),\"\")","v":""},null,null,null,null,null,null,null,"Beginn der Sommerferien","01.07.","<<(Punkte nicht vergessen)"]
[{"$f":"CHOOSE(WEEKDAY(B3),\"Sonntag\",\"Montag\",\"Dienstag\",\"Mittwoch\",\"Donnerstag\",\"Freitag\",\"Samstag\")","v":"Dienstag"},{"$f":"B2+1","v":"2016-09-13"},{"$f":"IFERROR(VLOOKUP(B3,Fixtermine!$B$1:$E$68,3,FALSE),\"\")","v":""}]
["Mittwoch","2016-09-14",{"$f":"IFERROR(VLOOKUP(B4,Fixtermine!$B$1:$E$68,3,FALSE),\"\")","v":""}]
["Donnerstag","2016-09-15",{"$f":"IFERROR(VLOOKUP(B5,Fixtermine!$B$1:$E$68,3,FALSE),\"\")","v":""}]
["Freitag","2016-09-16",{"$f":"IFERROR(VLOOKUP(B6,Fixtermine!$B$1:$E$68,3,FALSE),\"\")","v":""}]
["Samstag","2016-09-17",{"$f":"IFERROR(VLOOKUP(B7,Fixtermine!$B$1:$E$68,3,FALSE),\"\")","v":""}]
["Sonntag","2016-09-18",{"$f":"IFERROR(VLOOKUP(B8,Fixtermine!$B$1:$E$68,3,FALSE),\"\")","v":""}]
["Montag","2016-09-19",{"$f":"IFERROR(VLOOKUP(B9,Fixtermine!$B$1:$E$68,3,FALSE),\"\")","v":""}]
["Dienstag","2016-09-20",{"$f":"IFERROR(VLOOKUP(B10,Fixtermine!$B$1:$E$68,3,FALSE),\"\")","v":""}]
["Mittwoch","2016-09-21",{"$f":"IFERROR(VLOOKUP(B11,Fixtermine!$B$1:$E$68,3,FALSE),\"\")","v":""}]
["Donnerstag","2016-09-22",{"$f":"IFERROR(VLOOKUP(B12,Fixtermine!$B$1:$E$68,3,FALSE),\"\")","v":""}]
["Freitag","2016-09-23",{"$f":"IFERROR(VLOOKUP(B13,Fixtermine!$B$1:$E$68,3,FALSE),\"\")","v":""}]
["Samstag","2016-09-24",{"$f":"IFERROR(VLOOKUP(B14,Fixtermine!$B$1:$E$68,3,FALSE),\"\")","v":""}]
["Sonntag","2016-09-25",{"$f":"IFERROR(VLOOKUP(B15,Fixtermine!$B$1:$E$68,3,FALSE),\"\")","v":""}]
["Montag","2016-09-26",{"$f":"IFERROR(VLOOKUP(B16,Fixtermine!$B$1:$E$68,3,FALSE),\"\")","v":""}]
["Dienstag","2016-09-27",{"$f":"IFERROR(VLOOKUP(B17,Fixtermine!$B$1:$E$68,3,FALSE),\"\")","v":""}]
["Mittwoch","2016-09-28",{"$f":"IFERROR(VLOOKUP(B18,Fixtermine!$B$1:$E$68,3,FALSE),\"\")","v":""}]
["Donnerstag","2016-09-29",{"$f":"IFERROR(VLOOKUP(B19,Fixtermine!$B$1:$E$68,3,FALSE),\"\")","v":""}]
["Freitag","2016-09-30",{"$f":"IFERROR(VLOOKUP(B20,Fixtermine!$B$1:$E$68,3,FALSE),\"\")","v":""}]
["Samstag","2016-10-01",{"$f":"IFERROR(VLOOKUP(B21,Fixtermine!$B$1:$E$68,3,FALSE),\"\")","v":""}]
["Sonntag","2016-10-02",{"$f":"IFERROR(VLOOKUP(B22,Fixtermine!$B$1:$E$68,3,FALSE),\"\")","v":""}]
["Montag","2016-10-03",{"$f":"IFERROR(VLOOKUP(B23,Fixtermine!$B$1:$E$68,3,FALSE),\"\")","v":"FT-Tag d. Deut. Einheit"}]
["Dienstag","2016-10-04",{"$f":"IFERROR(VLOOKUP(B24,Fixtermine!$B$1:$E$68,3,FALSE),\"\")","v":""}]
["Mittwoch","2016-10-05",{"$f":"IFERROR(VLOOKUP(B25,Fixtermine!$B$1:$E$68,3,FALSE),\"\")","v":""}]
["Donnerstag","2016-10-06",{"$f":"IFERROR(VLOOKUP(B26,Fixtermine!$B$1:$E$68,3,FALSE),\"\")","v":""}]
["Freitag","2016-10-07",{"$f":"IFERROR(VLOOKUP(B27,Fixtermine!$B$1:$E$68,3,FALSE),\"\")","v":""}]
["Samstag","2016-10-08",{"$f":"IFERROR(VLOOKUP(B28,Fixtermine!$B$1:$E$68,3,FALSE),\"\")","v":""}]
["Sonntag","2016-10-09",{"$f":"IFERROR(VLOOKUP(B29,Fixtermine!$B$1:$E$68,3,FALSE),\"\")","v":""}]
["Montag","2016-10-10",{"$f":"IFERROR(VLOOKUP(B30,Fixtermine!$B$1:$E$68,3,FALSE),\"\")","v":""}]
["Dienstag","2016-10-11",{"$f":"IFERROR(VLOOKUP(B31,Fixtermine!$B$1:$E$68,3,FALSE),\"\")","v":""}]
["Mittwoch","2016-10-12",{"$f":"IFERROR(VLOOKUP(B32,Fixtermine!$B$1:$E$68,3,FALSE),\"\")","v":""}]
["Donnerstag","2016-10-13",{"$f":"IFERROR(VLOOKUP(B33,Fixtermine!$B$1:$E$68,3,FALSE),\"\")","v":""}]
["Freitag","2016-10-14",{"$f":"IFERROR(VLOOKUP(B34,Fixtermine!$B$1:$E$68,3,FALSE),\"\")","v":""}]
["Samstag","2016-10-15",{"$f":"IFERROR(VLOOKUP(B35,Fixtermine!$B$1:$E$68,3,FALSE),\"\")","v":""}]
["Sonntag","2016-10-16",{"$f":"IFERROR(VLOOKUP(B36,Fixtermine!$B$1:$E$68,3,FALSE),\"\")","v":""}]
["Montag","2016-10-17",{"$f":"IFERROR(VLOOKUP(B37,Fixtermine!$B$1:$E$68,3,FALSE),\"\")","v":""}]
["Dienstag","2016-10-18",{"$f":"IFERROR(VLOOKUP(B38,Fixtermine!$B$1:$E$68,3,FALSE),\"\")","v":""}]
["Mittwoch","2016-10-19",{"$f":"IFERROR(VLOOKUP(B39,Fixtermine!$B$1:$E$68,3,FALSE),\"\")","v":""}]
["Donnerstag","2016-10-20",{"$f":"IFERROR(VLOOKUP(B40,Fixtermine!$B$1:$E$68,3,FALSE),\"\")","v":""}]
["Freitag","2016-10-21",{"$f":"IFERROR(VLOOKUP(B41,Fixtermine!$B$1:$E$68,3,FALSE),\"\")","v":""}]
["Samstag","2016-10-22",{"$f":"IFERROR(VLOOKUP(B42,Fixtermine!$B$1:$E$68,3,FALSE),\"\")","v":""}]
["Sonntag","2016-10-23",{"$f":"IFERROR(VLOOKUP(B43,Fixtermine!$B$1:$E$68,3,FALSE),\"\")","v":""}]
["Montag","2016-10-24",{"$f":"IFERROR(VLOOKUP(B44,Fixtermine!$B$1:$E$68,3,FALSE),\"\")","v":""}]
["Dienstag","2016-10-25",{"$f":"IFERROR(VLOOKUP(B45,Fixtermine!$B$1:$E$68,3,FALSE),\"\")","v":""}]
["Mittwoch","2016-10-26",{"$f":"IFERROR(VLOOKUP(B46,Fixtermine!$B$1:$E$68,3,FALSE),\"\")","v":""}]
["Donnerstag","2016-10-27",{"$f":"IFERROR(VLOOKUP(B47,Fixtermine!$B$1:$E$68,3,FALSE),\"\")","v":""}]
["Freitag","2016-10-28",{"$f":"IFERROR(VLOOKUP(B48,Fixtermine!$B$1:$E$68,3,FALSE),\"\")","v":""}]
["Samstag","2016-10-29",{"$f":"IFERROR(VLOOKUP(B49,Fixtermine!$B$1:$E$68,3,FALSE),\"\")","v":""}]
["Sonntag","2016-10-30",{"$f":"IFERROR(VLOOKUP(B50,Fixtermine!$B$1:$E$68,3,FALSE),\"\")","v":""}]
["Montag","2016-10-31",{"$f":"IFERROR(VLOOKUP(B51,Fixtermine!$B$1:$E$68,3,FALSE),\"\")","v":"Herbstferien"}]
["Dienstag","2016-11-01",{"$f":"IFERROR(VLOOKUP(B52,Fixtermine!$B$1:$E$68,3,FALSE),\"\")","v":"FT-Allerheiligen"}]
["Mittwoch","2016-11-02",{"$f":"IFERROR(VLOOKUP(B53,Fixtermine!$B$1:$E$68,3,FALSE),\"\")","v":"Herbstferien"}]
["Donnerstag","2016-11-03",{"$f":"IFERROR(VLOOKUP(B54,Fixtermine!$B$1:$E$68,3,FALSE),\"\")","v":"Herbstferien"}]
["Freitag","2016-11-04",{"$f":"IFERROR(VLOOKUP(B55,Fixtermine!$B$1:$E$68,3,FALSE),\"\")","v":"Herbstferien"}]
["Samstag","2016-11-05",{"$f":"IFERROR(VLOOKUP(B56,Fixtermine!$B$1:$E$68,3,FALSE),\"\")","v":""}]
["Sonntag","2016-11-06",{"$f":"IFERROR(VLOOKUP(B57,Fixtermine!$B$1:$E$68,3,FALSE),\"\")","v":""}]
["Montag","2016-11-07",{"$f":"IFERROR(VLOOKUP(B58,Fixtermine!$B$1:$E$68,3,FALSE),\"\")","v":""}]
["Dienstag","2016-11-08",{"$f":"IFERROR(VLOOKUP(B59,Fixtermine!$B$1:$E$68,3,FALSE),\"\")","v":""}]
["Mittwoch","2016-11-09",{"$f":"IFERROR(VLOOKUP(B60,Fixtermine!$B$1:$E$68,3,FALSE),\"\")","v":""}]
["Donnerstag","2016-11-10",{"$f":"IFERROR(VLOOKUP(B61,Fixtermine!$B$1:$E$68,3,FALSE),\"\")","v":""}]
["Freitag","2016-11-11",{"$f":"IFERROR(VLOOKUP(B62,Fixtermine!$B$1:$E$68,3,FALSE),\"\")","v":""}]
["Samstag","2016-11-12",{"$f":"IFERROR(VLOOKUP(B63,Fixtermine!$B$1:$E$68,3,FALSE),\"\")","v":""}]
["Sonntag","2016-11-13",{"$f":"IFERROR(VLOOKUP(B64,Fixtermine!$B$1:$E$68,3,FALSE),\"\")","v":""}]
["Montag","2016-11-14",{"$f":"IFERROR(VLOOKUP(B65,Fixtermine!$B$1:$E$68,3,FALSE),\"\")","v":""}]
["Dienstag","2016-11-15",{"$f":"IFERROR(VLOOKUP(B66,Fixtermine!$B$1:$E$68,3,FALSE),\"\")","v":""}]
[{"$f":"CHOOSE(WEEKDAY(B67),\"Sonntag\",\"Montag\",\"Dienstag\",\"Mittwoch\",\"Donnerstag\",\"Freitag\",\"Samstag\")","v":"Mittwoch"},"2016-11-16",{"$f":"IFERROR(VLOOKUP(B67,Fixtermine!$B$1:$E$68,3,FALSE),\"\")","v":"Buß- u. Bettag"}]
["Donnerstag","2016-11-17",{"$f":"IFERROR(VLOOKUP(B68,Fixtermine!$B$1:$E$68,3,FALSE),\"\")","v":""}]
["Freitag",{"$f":"B68+1","v":"2016-11-18"},{"$f":"IFERROR(VLOOKUP(B69,Fixtermine!$B$1:$E$68,3,FALSE),\"\")","v":""}]
["Samstag","2016-11-19",{"$f":"IFERROR(VLOOKUP(B70,Fixtermine!$B$1:$E$68,3,FALSE),\"\")","v":""}]
["Sonntag","2016-11-20",{"$f":"IFERROR(VLOOKUP(B71,Fixtermine!$B$1:$E$68,3,FALSE),\"\")","v":""}]
["Montag","2016-11-21",{"$f":"IFERROR(VLOOKUP(B72,Fixtermine!$B$1:$E$68,3,FALSE),\"\")","v":""}]
["Dienstag","2016-11-22",{"$f":"IFERROR(VLOOKUP(B73,Fixtermine!$B$1:$E$68,3,FALSE),\"\")","v":""}]
["Mittwoch","2016-11-23",{"$f":"IFERROR(VLOOKUP(B74,Fixtermine!$B$1:$E$68,3,FALSE),\"\")","v":""}]
["Donnerstag","2016-11-24",{"$f":"IFERROR(VLOOKUP(B75,Fixtermine!$B$1:$E$68,3,FALSE),\"\")","v":""}]
["Freitag","2016-11-25",{"$f":"IFERROR(VLOOKUP(B76,Fixtermine!$B$1:$E$68,3,FALSE),\"\")","v":""}]
["Samstag","2016-11-26",{"$f":"IFERROR(VLOOKUP(B77,Fixtermine!$B$1:$E$68,3,FALSE),\"\")","v":""}]
["Sonntag","2016-11-27",{"$f":"IFERROR(VLOOKUP(B78,Fixtermine!$B$1:$E$68,3,FALSE),\"\")","v":"1. Advent"}]
["Montag","2016-11-28",{"$f":"IFERROR(VLOOKUP(B79,Fixtermine!$B$1:$E$68,3,FALSE),\"\")","v":""}]
["Dienstag","2016-11-29",{"$f":"IFERROR(VLOOKUP(B80,Fixtermine!$B$1:$E$68,3,FALSE),\"\")","v":""}]
["Mittwoch","2016-11-30",{"$f":"IFERROR(VLOOKUP(B81,Fixtermine!$B$1:$E$68,3,FALSE),\"\")","v":""}]
["Donnerstag","2016-12-01",{"$f":"IFERROR(VLOOKUP(B82,Fixtermine!$B$1:$E$68,3,FALSE),\"\")","v":""}]
["Freitag","2016-12-02",{"$f":"IFERROR(VLOOKUP(B83,Fixtermine!$B$1:$E$68,3,FALSE),\"\")","v":""}]
["Samstag","2016-12-03",{"$f":"IFERROR(VLOOKUP(B84,Fixtermine!$B$1:$E$68,3,FALSE),\"\")","v":""}]
["Sonntag","2016-12-04",{"$f":"IFERROR(VLOOKUP(B85,Fixtermine!$B$1:$E$68,3,FALSE),\"\")","v":"2. Advent"}]
["Montag","2016-12-05",{"$f":"IFERROR(VLOOKUP(B86,Fixtermine!$B$1:$E$68,3,FALSE),\"\")","v":""}]
["Dienstag","2016-12-06",{"$f":"IFERROR(VLOOKUP(B87,Fixtermine!$B$1:$E$68,3,FALSE),\"\")","v":""}]
["Mittwoch","2016-12-07",{"$f":"IFERROR(VLOOKUP(B88,Fixtermine!$B$1:$E$68,3,FALSE),\"\")","v":""}]
["Donnerstag","2016-12-08",{"$f":"IFERROR(VLOOKUP(B89,Fixtermine!$B$1:$E$68,3,FALSE),\"\")","v":""}]
["Freitag","2016-12-09",{"$f":"IFERROR(VLOOKUP(B90,Fixtermine!$B$1:$E$68,3,FALSE),\"\")","v":""}]
["Samstag","2016-12-10",{"$f":"IFERROR(VLOOKUP(B91,Fixtermine!$B$1:$E$68,3,FALSE),\"\")","v":""}]
["Sonntag","2016-12-11",{"$f":"IFERROR(VLOOKUP(B92,Fixtermine!$B$1:$E$68,3,FALSE),\"\")","v":"3. Advent"}]
["Montag","2016-12-12",{"$f":"IFERROR(VLOOKUP(B93,Fixtermine!$B$1:$E$68,3,FALSE),\"\")","v":""}]
["Dienstag","2016-12-13",{"$f":"IFERROR(VLOOKUP(B94,Fixtermine!$B$1:$E$68,3,FALSE),\"\")","v":""}]
["Mittwoch","2016-12-14",{"$f":"IFERROR(VLOOKUP(B95,Fixtermine!$B$1:$E$68,3,FALSE),\"\")","v":""}]
["Donnerstag","2016-12-15",{"$f":"IFERROR(VLOOKUP(B96,Fixtermine!$B$1:$E$68,3,FALSE),\"\")","v":""}]
["Freitag","2016-12-16",{"$f":"IFERROR(VLOOKUP(B97,Fixtermine!$B$1:$E$68,3,FALSE),\"\")","v":""}]
["Samstag","2016-12-17",{"$f":"IFERROR(VLOOKUP(B98,Fixtermine!$B$1:$E$68,3,FALSE),\"\")","v":""}]
["Sonntag","2016-12-18",{"$f":"IFERROR(VLOOKUP(B99,Fixtermine!$B$1:$E$68,3,FALSE),\"\")","v":"4. Apfent"}]
["Montag","2016-12-19",{"$f":"IFERROR(VLOOKUP(B100,Fixtermine!$B$1:$E$68,3,FALSE),\"\")","v":""}]
["Dienstag","2016-12-20",{"$f":"IFERROR(VLOOKUP(B101,Fixtermine!$B$1:$E$68,3,FALSE),\"\")","v":""}]
["Mittwoch","2016-12-21",{"$f":"IFERROR(VLOOKUP(B102,Fixtermine!$B$1:$E$68,3,FALSE),\"\")","v":""}]
["Donnerstag","2016-12-22",{"$f":"IFERROR(VLOOKUP(B103,Fixtermine!$B$1:$E$68,3,FALSE),\"\")","v":""}]
["Freitag","2016-12-23",{"$f":"IFERROR(VLOOKUP(B104,Fixtermine!$B$1:$E$68,3,FALSE),\"\")","v":""}]
["Samstag","2016-12-24",{"$f":"IFERROR(VLOOKUP(B105,Fixtermine!$B$1:$E$68,3,FALSE),\"\")","v":"Hl. Abend / Ferien"}]
["Sonntag","2016-12-25",{"$f":"IFERROR(VLOOKUP(B106,Fixtermine!$B$1:$E$68,3,FALSE),\"\")","v":"FT-1. Weihnachtsfeiertag"}]
["Montag","2016-12-26",{"$f":"IFERROR(VLOOKUP(B107,Fixtermine!$B$1:$E$68,3,FALSE),\"\")","v":"FT-2. Weihnachtsfeiertag"}]
["Dienstag","2016-12-27",{"$f":"IFERROR(VLOOKUP(B108,Fixtermine!$B$1:$E$68,3,FALSE),\"\")","v":"Weihnachtsferien"}]
["Mittwoch","2016-12-28",{"$f":"IFERROR(VLOOKUP(B109,Fixtermine!$B$1:$E$68,3,FALSE),\"\")","v":"Weihnachtsferien"}]
["Donnerstag","2016-12-29",{"$f":"IFERROR(VLOOKUP(B110,Fixtermine!$B$1:$E$68,3,FALSE),\"\")","v":"Weihnachtsferien"}]
["Freitag","2016-12-30",{"$f":"IFERROR(VLOOKUP(B111,Fixtermine!$B$1:$E$68,3,FALSE),\"\")","v":"Weihnachtsferien"}]
["Samstag","2016-12-31",{"$f":"IFERROR(VLOOKUP(B112,Fixtermine!$B$1:$E$68,3,FALSE),\"\")","v":"Weihnachtsferien"}]
["Sonntag","2017-01-01",{"$f":"IFERROR(VLOOKUP(B113,Fixtermine!$B$1:$E$68,3,FALSE),\"\")","v":"FT-Neujahr"}]
["Montag","2017-01-02",{"$f":"IFERROR(VLOOKUP(B114,Fixtermine!$B$1:$E$68,3,FALSE),\"\")","v":"Weihnachtsferien"}]
["Dienstag","2017-01-03",{"$f":"IFERROR(VLOOKUP(B115,Fixtermine!$B$1:$E$68,3,FALSE),\"\")","v":"Weihnachtsferien"}]
["Mittwoch","2017-01-04",{"$f":"IFERROR(VLOOKUP(B116,Fixtermine!$B$1:$E$68,3,FALSE),\"\")","v":"Weihnachtsferien"}]
["Donnerstag","2017-01-05",{"$f":"IFERROR(VLOOKUP(B117,Fixtermine!$B$1:$E$68,3,FALSE),\"\")","v":"Weihnachtsferien"}]
["Freitag","2017-01-06",{"$f":"IFERROR(VLOOKUP(B118,Fixtermine!$B$1:$E$68,3,FALSE),\"\")","v":"FT-Hl. 3 Könige"}]
["Samstag","2017-01-07",{"$f":"IFERROR(VLOOKUP(B119,Fixtermine!$B$1:$E$68,3,FALSE),\"\")","v":""}]
["Sonntag","2017-01-08",{"$f":"IFERROR(VLOOKUP(B120,Fixtermine!$B$1:$E$68,3,FALSE),\"\")","v":""}]
{"$rows_left_out":211}
{"sheet":"Fixtermine","index":1,"n_rows":68,"n_cols":10,"rows_kept":68,"cut":false,"hidden":true,"merged":[[1,6,12,6]]}
[{"$f":"CHOOSE(WEEKDAY(E1),\"Sonntag\",\"Montag\",\"Dienstag\",\"Mittwoch\",\"Donnerstag\",\"Freitag\",\"Samstag\")","v":"Montag"},{"$f":"DATEVALUE(E1)","v":42646},"03.10.","FT-Tag d. Deut. Einheit",{"$f":"IF(VALUE(MID(C1,4,2))>8,CONCATENATE(C1,$H$1-1),CONCATENATE(C1,$H$1))","v":"03.10.2016"},null,"Jahr",{"$f":"YEAR(Kalender!B2)+1","v":2017}]
[{"$f":"CHOOSE(WEEKDAY(E2),\"Sonntag\",\"Montag\",\"Dienstag\",\"Mittwoch\",\"Donnerstag\",\"Freitag\",\"Samstag\")","v":"Dienstag"},{"$f":"DATEVALUE(E2)","v":42675},"01.11.","FT-Allerheiligen",{"$f":"IF(VALUE(MID(C2,4,2))>8,CONCATENATE(C2,$H$1-1),CONCATENATE(C2,$H$1))","v":"01.11.2016"},null,"Gausssche Osterformel",{"$f":"MOD(H1,19)","v":3}]
["Montag",{"$f":"$B$2+2-$I$31","v":42674},null,"Herbstferien",{"$f":"B3","v":"2016-10-31"},null,null,{"$f":"MOD(H1,4)","v":1}]
["Dienstag",{"$f":"$B$2+3-$I$31","v":42675},null,"Herbstferien",{"$f":"B4","v":"2016-11-01"},null,null,{"$f":"MOD(H1,7)","v":1}]
["Mittwoch",{"$f":"$B$2+4-$I$31","v":42676},null,"Herbstferien",{"$f":"B5","v":"2016-11-02"},null,null,{"$f":"TRUNC((8*(TRUNC(H1/100))+13)/25)-2","v":4}]
["Donnerstag",{"$f":"$B$2+5-$I$31","v":42677},null,"Herbstferien",{"$f":"B6","v":"2016-11-03"},null,null,{"$f":"TRUNC(H1/100)-TRUNC(H1/400)-2","v":13}]
["Freitag",{"$f":"$B$2+6-$I$31","v":42678},null,"Herbstferien",{"$f":"B7","v":"2016-11-04"},null,null,{"$f":"MOD(15+H6-H5,30)","v":24}]
["Mittwoch",{"$f":"DATEVALUE(E8)","v":42690},{"$f":"VLOOKUP(4,$G$23:$J$29,3,TRUE)","v":"16.11."},"Buß- u. Bettag",{"$f":"IF(VALUE(MID(C8,4,2))>8,CONCATENATE(C8,$H$1-1),CONCATENATE(C8,$H$1))","v":"16.11.2016"},null,null,{"$f":"MOD(6+H6,7)","v":5}]
["Sonntag",{"$f":"B10-7","v":42701},null,"1. Advent",{"$f":"B9","v":"2016-11-27"},null,null,{"$f":"MOD(H7+19*H2,30)","v":21}]
["Sonntag",{"$f":"B11-7","v":42708},null,"2. Advent","2016-12-04",null,null,{"$f":"IF(H9=29,28,IF(AND(H9=28,H2>=11),27,IF(AND(H9<28,H9>29),,H9)))","v":21}]
["Sonntag",{"$f":"B12-7","v":42715},null,"3. Advent","2016-12-11",null,null,{"$f":"MOD(2*H3+4*H4+6*H10+H8,7)","v":4}]
["Sonntag",{"$f":"B13-WEEKDAY(B13)+1","v":42722},null,{"$f":"IF(WEEKDAY(B13)=1,D13,\"4. Apfent\")","v":"4. Apfent"},{"$f":"B12","v":"2016-12-18"},null,null,{"$f":"H10+H11+1","v":26}]
["Samstag",42728,"24.12.","Hl. Abend / Ferien",{"$f":"IF(VALUE(MID(C13,4,2))>8,CONCATENATE(C13,$H$1-1),CONCATENATE(C13,$H$1))","v":"24.12.2016"},null,null,{"$f":"DATEVALUE(CONCATENATE(\"21.märz\",H1))","v":42815}]
["Sonntag",42729,"25.12.","FT-1. Weihnachtsfeiertag","25.12.2016",null,"Ostersonntag",{"$f":"H12+H13","v":"2017-04-16"}]
["Montag",42730,"26.12.","FT-2. Weihnachtsfeiertag","26.12.2016",null,"Tag",{"$f":"DAY(H14)","v":16}]
["Dienstag",42731,"27.12.","Weihnachtsferien","27.12.2016",null,"Monat",{"$f":"MONTH(H14)","v":4}]
["Mittwoch",42732,"28.12.","Weihnachtsferien","28.12.2016",null,"Jahr",{"$f":"YEAR(H14)","v":2017}]
["Donnerstag",42733,"29.12.","Weihnachtsferien","29.12.2016",null,"Zusammengebastelt",{"$f":"CONCATENATE(H15,\".\",H16,\".\",H17)","v":"16.4.2017"}]
["Freitag",42734,"30.12.","Weihnachtsferien","30.12.2016"]
["Samstag",42735,"31.12.","Weihnachtsferien","31.12.2016",null,"akt. Dat.(Heute)",{"$f":"TODAY()","v":42364}]
["Sonntag",42736,"01.01.","FT-Neujahr","01.01.2017"]
["Montag",42737,"02.01.","Weihnachtsferien","02.01.2017",null,"Buß- u. Bettag zw. 16.11. und 22.11."]
["Dienstag",42738,"03.01.","Weihnachtsferien","03.01.2017",null,{"$f":"WEEKDAY(J23)","v":4},{"$f":"CHOOSE(WEEKDAY(J23),\"Sonntag\",\"Montag\",\"Dienstag\",\"Mittwoch\",\"Donnerstag\",\"Freitag\",\"Samstag\")","v":"Mittwoch"},"16.11.",{"$f":"IF(VALUE(MID(I23,4,2))>8,CONCATENATE(I23,$H$1-1),CONCATENATE(I23,$H$1))","v":"16.11.2016"}]
["Mittwoch",42739,"04.01.","Weihnachtsferien","04.01.2017",null,5,"Donnerstag","17.11.","17.11.2016"]
["Donnerstag",42740,"05.01.","Weihnachtsferien","05.01.2017",null,6,"Freitag","18.11.","18.11.2016"]
["Freitag",42741,"06.01.","FT-Hl. 3 Könige","06.01.2017",null,7,"Samstag","19.11.","19.11.2016"]
["Montag",{"$f":"DATEVALUE(H$18)-48","v":42793},null,"Frühjahrsferien",{"$f":"B27","v":"2017-02-27"},null,1,"Sonntag","20.11.","20.11.2016"]
["Dienstag",{"$f":"DATEVALUE(H$18)-47","v":42794},null,"Frühjahrsferien","2017-02-28",null,2,"Montag","21.11.","21.11.2016"]
["Mittwoch",{"$f":"DATEVALUE(H$18)-46","v":42795},null,"Aschermittw. / Ferien","2017-03-01",null,3,"Dienstag","22.11.","22.11.2016"]
["Donnerstag",{"$f":"DATEVALUE(H$18)-45","v":42796},null,"Frühjahrsferien","2017-03-02"]
["Freitag",{"$f":"DATEVALUE(H$18)-44","v":42797},null,"Frühjahrsferien","2017-03-03",null,"Herbstferienberechn.","Wochentagserm.",{"$f":"VLOOKUP(C2,G32:J42,2,TRUE)","v":3},{"$f":"CHOOSE(WEEKDAY(I31),\"Sonntag\",\"Montag\",\"Dienstag\",\"Mittwoch\",\"Donnerstag\",\"Freitag\",\"Samstag\")","v":"Dienstag"}]
["Montag",{"$f":"DATEVALUE(H$18)-6","v":42835},null,"Osterferien","2017-04-10",null,"27.10.",{"$f":"WEEKDAY(J32)","v":5},{"$f":"CHOOSE(WEEKDAY(J32),\"Sonntag\",\"Montag\",\"Dienstag\",\"Mittwoch\",\"Donnerstag\",\"Freitag\",\"Samstag\")","v":"Donnerstag"},{"$f":"IF(VALUE(MID(G32,4,2))>8,CONCATENATE(G32,$H$1-1),CONCATENATE(G32,$H$1))","v":"27.10.2016"}]
["Dienstag",{"$f":"DATEVALUE(H$18)-5","v":42836},null,"Osterferien","2017-04-11",null,"28.10.",6,"Freitag","28.10.2016"]
["Mittwoch",{"$f":"DATEVALUE(H$18)-4","v":42837},null,"Osterferien","2017-04-12",null,"29.10.",7,"Samstag","29.10.2016"]
["Donnerstag",{"$f":"DATEVALUE(H$18)-3","v":42838},null,"Osterferien","2017-04-13",null,"30.10.",1,"Sonntag","30.10.2016"]
["Freitag",{"$f":"DATEVALUE(H$18)-2","v":42839},null,"FT-Karfreitag","2017-04-14",null,"31.10.",2,"Montag","31.10.2016"]
["Samstag",{"$f":"DATEVALUE(H$18)-1","v":42840},null,"Osterferien","2017-04-15",null,"01.11.",3,"Dienstag","01.11.2016"]
["Sonntag",{"$f":"DATEVALUE(H$18)","v":42841},null,"FT-Ostersonntag","2017-04-16",null,"02.11.",4,"Mittwoch","02.11.2016"]
["Montag",{"$f":"DATEVALUE(H$18)+1","v":42842},null,"FT-Ostermontag","2017-04-17",null,"03.11.",5,"Donnerstag","03.11.2016"]
["Dienstag",{"$f":"DATEVALUE(H$18)+2","v":42843},null,"Osterferien","2017-04-18",null,"04.11.",6,"Freitag","04.11.2016"]
["Mittwoch",{"$f":"DATEVALUE(H$18)+3","v":42844},null,"Osterferien","2017-04-19",null,"05.11.",7,"Samstag","05.11.2016"]
["Donnerstag",{"$f":"DATEVALUE(H$18)+4","v":42845},null,"Osterferien","2017-04-20",null,"06.11.",1,"Sonntag","06.11.2016"]
["Freitag",{"$f":"DATEVALUE(H$18)+5","v":42846},null,"Osterferien","2017-04-21"]
["Montag",{"$f":"DATEVALUE(E44)","v":42856},"01.05.","FT-Tag der Arbeit",{"$f":"IF(VALUE(MID(C44,4,2))>8,CONCATENATE(C44,$H$1-1),CONCATENATE(C44,$H$1))","v":"01.05.2017"},null,"Sommerferientabelle",null,"Beginn","Ende (einschließlich)"]
["Donnerstag",{"$f":"DATEVALUE(H$18)+39","v":42880},null,"FT-Ch. Himmelfahrt",{"$f":"B45","v":"2017-05-25"},null,{"$f":"IF(I45=0,\"\",YEAR(I45))","v":2016},{"$f":"IF(I45=0,\"\",CONCATENATE(IF(DAY(I45)<10,CONCATENATE(\"0\",DAY(I45)),DAY(I45)),\".\",IF(MONTH(I45)<10,CONCATENATE(\"0\",MONTH(I45)),MONTH(I45)),\".\"))","v":"30.07."},"2016-07-30","2016-09-12"]
["Sonntag",{"$f":"DATEVALUE(H$18)+49","v":42890},null,"FT-Pfingstsonntag","2017-06-04",null,{"$f":"IF(I46=0,\"\",YEAR(I46))","v":2017},{"$f":"IF(I46=0,\"\",CONCATENATE(IF(DAY(I46)<10,CONCATENATE(\"0\",DAY(I46)),DAY(I46)),\".\",IF(MONTH(I46)<10,CONCATENATE(\"0\",MONTH(I46)),MONTH(I46)),\".\"))","v":"29.07."},"2017-07-29","2017-09-11"]
["Montag",{"$f":"DATEVALUE(H$18)+50","v":42891},null,"FT-Pfingstmontag","2017-06-05",null,2018,"30.07.","2018-07-30","2018-09-10"]
["Dienstag",{"$f":"DATEVALUE(H$18)+51","v":42892},null,"Pfingstferien","2017-06-06",null,2019,"29.07.","2019-07-29","2019-09-09"]
["Mittwoch",{"$f":"DATEVALUE(H$18)+52","v":42893},null,"Pfingstferien","2017-06-07",null,2020,"27.07.","2020-07-27","2020-09-07"]
["Donnerstag",{"$f":"DATEVALUE(H$18)+53","v":42894},null,"Pfingstferien","2017-06-08",null,2021,"30.07.","2021-07-30","2021-09-13"]
["Freitag",{"$f":"DATEVALUE(H$18)+54","v":42895},null,"Pfingstferien","2017-06-09",null,2022,"01.08.","2022-08-01","2022-09-12"]
["Samstag",{"$f":"DATEVALUE(H$18)+55","v":42896},null,"Pfingstferien","2017-06-10",null,2023,"31.07.","2023-07-31","2023-09-11"]
["Sonntag",{"$f":"DATEVALUE(H$18)+56","v":42897},null,"Pfingstferien","2017-06-11",null,2024,"29.07.","2024-07-29","2024-09-09"]
["Montag",{"$f":"DATEVALUE(H$18)+57","v":42898},null,"Pfingstferien","2017-06-12",null,"",""]
["Dienstag",{"$f":"DATEVALUE(H$18)+58","v":42899},null,"Pfingstferien","2017-06-13",null,"",""]
["Mittwoch",{"$f":"DATEVALUE(H$18)+59","v":42900},null,"Pfingstferien","2017-06-14",null,"",""]
["Donnerstag",{"$f":"DATEVALUE(H$18)+60","v":42901},null,"FT-Fronleichnam","2017-06-15",null,"",""]
["Freitag",{"$f":"DATEVALUE(H$18)+61","v":42902},null,"Pfingstferien","2017-06-16",null,"",""]
["Samstag",{"$f":"DATEVALUE(E59)","v":42945},{"$f":"H68","v":"29.07."},"Sommerferien",{"$f":"IF(VALUE(MID(C59,4,2))>8,CONCATENATE(C59,$H$1-1),CONCATENATE(C59,$H$1))","v":"29.07.2017"},null,"",""]
["Sonntag",{"$f":"B59+1","v":42946},null,"Sommerferien",{"$f":"B60","v":"2017-07-30"},null,"",""]
["Montag",42947,null,"Sommerferien","2017-07-31",null,"",""]
["Dienstag",42948,null,"Sommerferien","2017-08-01",null,"",""]
["Mittwoch",42949,null,"Sommerferien","2017-08-02",null,"",""]
["Donnerstag",42950,null,"Sommerferien","2017-08-03",null,"",""]
["Freitag",42951,null,"Sommerferien","2017-08-04",null,"",""]
["Samstag",42952,null,"Sommerferien","2017-08-05",null,"",""]
["Sonntag",42953,null,"Sommerferien","2017-08-06",null,"",""]
["Dienstag",{"$f":"DATEVALUE(E68)","v":42962},"15.08.","FT-Maria Himmelfahrt",{"$f":"IF(VALUE(MID(C68,4,2))>8,CONCATENATE(C68,$H$1-1),CONCATENATE(C68,$H$1))","v":"15.08.2017"},null,null,{"$f":"VLOOKUP(H1,G45:I54,2)","v":"29.07."}]